{"text_format":"2","workbook":"xlsx","n_sheets":16,"sheets":["Instructions","Actuals summary","Variance summary","Jan","Feb","Mar","Apr","May","Jun","Jul","Aug","Sep","Oct","Nov","Dec","Data"],"not_rendered":{"charts":30,"images":0,"macros":0,"external_links":0,"defined_names":0,"comments":12,"pivot_tables":0},"unopened":[],"bounds":{"document_bytes":16777216,"sheet_cells":100000,"run_cost":"one","rows_first":2000,"rows_last":500,"rows_between":2000,"halvings":0,"cell_chars":16384,"cell_head_chars":4096},"cells_cut":0,"cells_raw":0,"read":"whole","date_system":"1900"}

{"sheet":"Instructions","index":0,"n_rows":55,"n_cols":3,"rows_kept":55,"cut":false,"hidden":false,"merged":[[6,1,6,2],[0,1,0,2],[1,1,1,2],[2,1,2,2],[3,1,3,2],[5,1,5,2],[8,1,8,2],[9,1,9,2],[11,1,11,2],[12,1,12,2],[16,1,16,2],[48,1,48,2],[51,1,51,2],[24,1,24,2],[21,1,21,2],[29,1,29,2],[34,1,34,2],[38,1,38,2],[42,1,42,2]]}
[null,"How To Use The Simple Budgeting Worksheet"]
[null,"Copyright © 2018 Enrich - The Ultimate Resource for Understanding Money and Making Wise Financial Decisions"]
[null,"Actuals Summary Tab - [no action required]"]
[null,"Do not enter any amounts on this page. Amounts will populate based on any monthly tab completed. This tab will show the actual amounts paid by month for any section of the budget calculator which is completed."]
[]
[null,"Variance Summary Tab - [no action required]"]
{"$rows_left_out":50}
{"sheet":"Actuals summary","index":1,"n_rows":119,"n_cols":15,"rows_kept":119,"cut":false,"hidden":false,"merged":[[118,1,119,14],[70,1,71,14],[4,1,4,14],[26,1,26,14],[0,1,0,14],[22,1,23,14],[44,1,45,14]]}
[null,"Annual Summary - Budgeting Details"]
[]
[]
[]
[null,"Monthly Actuals"]
[null,null,{"$f":"Data!C1","v":"January"},{"$f":"Data!D1","v":"February"},{"$f":"Data!E1","v":"March"},{"$f":"Data!F1","v":"April"},{"$f":"Data!G1","v":"May"},{"$f":"Data!H1","v":"June"},{"$f":"Data!I1","v":"July"},{"$f":"Data!J1","v":"August"},{"$f":"Data!K1","v":"September"},{"$f":"Data!L1","v":"October"},{"$f":"Data!M1","v":"November"},{"$f":"Data!N1","v":"December"},"Total"]
{"$rows_left_out":54}
{"sheet":"Variance summary","index":2,"n_rows":116,"n_cols":17,"rows_kept":116,"cut":false,"hidden":false,"merged":[[72,1,73,14],[115,1,116,14],[4,1,4,14],[0,1,0,14],[26,1,26,14],[22,1,23,14],[44,1,45,14]]}
[null,"Annual Summary - Variance Analysis"]
[]
[]
[]
[null,"Monthly Variance Analysis"]
[null,null,{"$f":"Data!C1","v":"January"},{"$f":"Data!D1","v":"February"},{"$f":"Data!E1","v":"March"},{"$f":"Data!F1","v":"April"},{"$f":"Data!G1","v":"May"},{"$f":"Data!H1","v":"June"},{"$f":"Data!I1","v":"July"},{"$f":"Data!J1","v":"August"},{"$f":"Data!K1","v":"September"},{"$f":"Data!L1","v":"October"},{"$f":"Data!M1","v":"November"},{"$f":"Data!N1","v":"December"},"Total"]
{"$rows_left_out":54}
{"sheet":"Jan","index":3,"n_rows":92,"n_cols":11,"rows_kept":92,"cut":false,"hidden":false,"merged":[[12,2,12,5],[2,7,2,10],[2,2,2,5],[0,2,0,10]]}
[null,null,"January"]
[]
[null,null,"What's Coming In This Month?",{"$nulls":4},"How Am I Doing?"]
[]
[null,null,"INCOME","Planned","Actual","Difference",null,null,"Planned","Actual","Difference"]
[null,null,"Your Job",0,0,{"$f":"-D6+E6","v":0},null,"Total INCOME",{"$f":"D10","v":0},{"$f":"E10","v":0},{"$f":"-I6+J6","v":0}]
{"$rows_left_out":87}
{"sheet":"Feb","index":4,"n_rows":92,"n_cols":11,"rows_kept":92,"cut":false,"hidden":false,"merged":[[0,2,0,10],[2,2,2,5],[2,7,2,10],[12,2,12,5]]}
[null,null,"February"]
[]
[null,null,"What's Coming In This Month?",{"$nulls":4},"How Am I Doing?"]
[]
[null,null,"INCOME","Planned","Actual","Difference",null,null,"Planned","Actual","Difference"]
[null,null,"Your Job",0,0,{"$f":"-D6+E6","v":0},null,"Total INCOME",{"$f":"D10","v":0},{"$f":"E10","v":0},{"$f":"-I6+J6","v":0}]
{"$rows_left_out":87}
{"sheet":"Mar","index":5,"n_rows":92,"n_cols":11,"rows_kept":92,"cut":false,"hidden":false,"merged":[[0,2,0,10],[2,2,2,5],[2,7,2,10],[12,2,12,5]]}
[null,null,"March"]
[]
[null,null,"What's Coming In This Month?",{"$nulls":4},"How Am I Doing?"]
[]
[null,null,"INCOME","Planned","Actual","Difference",null,null,"Planned","Actual","Difference"]
[null,null,"Your Job",0,0,{"$f":"-D6+E6","v":0},null,"Total INCOME",{"$f":"D10","v":0},{"$f":"E10","v":0},{"$f":"-I6+J6","v":0}]
{"$rows_left_out":87}
{"sheet":"Apr","index":6,"n_rows":92,"n_cols":11,"rows_kept":92,"cut":false,"hidden":false,"merged":[[0,2,0,10],[2,2,2,5],[2,7,2,10],[12,2,12,5]]}
[null,null,"April"]
[]
[null,null,"What's Coming In This Month?",{"$nulls":4},"How Am I Doing?"]
[]
[null,null,"INCOME","Planned","Actual","Difference",null,null,"Planned","Actual","Difference"]
[null,null,"Your Job",0,0,{"$f":"-D6+E6","v":0},null,"Total INCOME",{"$f":"D10","v":0},{"$f":"E10","v":0},{"$f":"-I6+J6","v":0}]
{"$rows_left_out":87}
{"sheet":"May","index":7,"n_rows":92,"n_cols":11,"rows_kept":92,"cut":false,"hidden":false,"merged":[[0,2,0,10],[2,2,2,5],[2,7,2,10],[12,2,12,5]]}
[null,null,"May"]
[]
[null,null,"What's Coming In This Month?",{"$nulls":4},"How Am I Doing?"]
[]
[null,null,"INCOME","Planned","Actual","Difference",null,null,"Planned","Actual","Difference"]
[null,null,"Your Job",0,0,{"$f":"-D6+E6","v":0},null,"Total INCOME",{"$f":"D10","v":0},{"$f":"E10","v":0},{"$f":"-I6+J6","v":0}]
{"$rows_left_out":87}
{"sheet":"Jun","index":8,"n_rows":92,"n_cols":11,"rows_kept":92,"cut":false,"hidden":false,"merged":[[0,2,0,10],[2,2,2,5],[2,7,2,10],[12,2,12,5]]}
[null,null,"June"]
[]
[null,null,"What's Coming In This Month?",{"$nulls":4},"How Am I Doing?"]
[]
[null,null,"INCOME","Planned","Actual","Difference",null,null,"Planned","Actual","Difference"]
[null,null,"Your Job",0,0,{"$f":"-D6+E6","v":0},null,"Total INCOME",{"$f":"D10","v":0},{"$f":"E10","v":0},{"$f":"-I6+J6","v":0}]
{"$rows_left_out":87}
{"sheet":"Jul","index":9,"n_rows":92,"n_cols":11,"rows_kept":92,"cut":false,"hidden":false,"merged":[[0,2,0,10],[2,2,2,5],[2,7,2,10],[12,2,12,5]]}
[null,null,"July"]
[]
[null,null,"What's Coming In This Month?",{"$nulls":4},"How Am I Doing?"]
[]
[null,null,"INCOME","Planned","Actual","Difference",null,null,"Planned","Actual","Difference"]
[null,null,"Your Job",0,0,{"$f":"-D6+E6","v":0},null,"Total INCOME",{"$f":"D10","v":0},{"$f":"E10","v":0},{"$f":"-I6+J6","v":0}]
{"$rows_left_out":87}
{"sheet":"Aug","index":10,"n_rows":92,"n_cols":11,"rows_kept":92,"cut":false,"hidden":false,"merged":[[0,2,0,10],[2,2,2,5],[2,7,2,10],[12,2,12,5]]}
[null,null,"August"]
[]
[null,null,"What's Coming In This Month?",{"$nulls":4},"How Am I Doing?"]
[]
[null,null,"INCOME","Planned","Actual","Difference",null,null,"Planned","Actual","Difference"]
[null,null,"Your Job",0,0,{"$f":"-D6+E6","v":0},null,"Total INCOME",{"$f":"D10","v":0},{"$f":"E10","v":0},{"$f":"-I6+J6","v":0}]
{"$rows_left_out":87}
{"sheet":"Sep","index":11,"n_rows":92,"n_cols":11,"rows_kept":92,"cut":false,"hidden":false,"merged":[[0,2,0,10],[2,2,2,5],[2,7,2,10],[12,2,12,5]]}
[null,null,"September"]
[]
[null,null,"What's Coming In This Month?",{"$nulls":4},"How Am I Doing?"]
[]
[null,null,"INCOME","Planned","Actual","Difference",null,null,"Planned","Actual","Difference"]
[null,null,"Your Job",0,0,{"$f":"-D6+E6","v":0},null,"Total INCOME",{"$f":"D10","v":0},{"$f":"E10","v":0},{"$f":"-I6+J6","v":0}]
{"$rows_left_out":87}
{"sheet":"Oct","index":12,"n_rows":92,"n_cols":11,"rows_kept":92,"cut":false,"hidden":false,"merged":[[0,2,0,10],[2,2,2,5],[2,7,2,10],[12,2,12,5]]}
[null,null,"October"]
[]
[null,null,"What's Coming In This Month?",{"$nulls":4},"How Am I Doing?"]
[]
[null,null,"INCOME","Planned","Actual","Difference",null,null,"Planned","Actual","Difference"]
[null,null,"Your Job",0,0,{"$f":"-D6+E6","v":0},null,"Total INCOME",{"$f":"D10","v":0},{"$f":"E10","v":0},{"$f":"-I6+J6","v":0}]
{"$rows_left_out":87}
{"sheet":"Nov","index":13,"n_rows":92,"n_cols":11,"rows_kept":92,"cut":false,"hidden":false,"merged":[[0,2,0,10],[2,2,2,5],[2,7,2,10],[12,2,12,5]]}
[null,null,"November"]
[]
[null,null,"What's Coming In This Month?",{"$nulls":4},"How Am I Doing?"]
[]
[null,null,"INCOME","Planned","Actual","Difference",null,null,"Planned","Actual","Difference"]
[null,null,"Your Job",0,0,{"$f":"-D6+E6","v":0},null,"Total INCOME",{"$f":"D10","v":0},{"$f":"E10","v":0},{"$f":"-I6+J6","v":0}]
{"$rows_left_out":87}
{"sheet":"Dec","index":14,"n_rows":92,"n_cols":11,"rows_kept":92,"cut":false,"hidden":false,"merged":[[0,2,0,10],[2,2,2,5],[2,7,2,10],[12,2,12,5]]}
[null,null,"December"]
[]
[null,null,"What's Coming In This Month?",{"$nulls":4},"How Am I Doing?"]
[]
[null,null,"INCOME","Planned","Actual","Difference",null,null,"Planned","Actual","Difference"]
[null,null,"Your Job",0,0,{"$f":"-D6+E6","v":0},null,"Total INCOME",{"$f":"D10","v":0},{"$f":"E10","v":0},{"$f":"-I6+J6","v":0}]
{"$rows_left_out":87}
{"sheet":"Data","index":15,"n_rows":18,"n_cols":63,"rows_kept":18,"cut":false,"hidden":true,"merged":[]}
[null,"Actuals","January","February","March","April","May","June","July","August","September","October","November","December",null,"Budget",{"$f":"C1","v":"January"},"February","March","April","May","June","July","August","September","October","November","December",null,"Actuals # of months","Actuals Total",null,"Budget # of months","Budget total",null,"Variance",{"$f":"Q1","v":"January"},{"$f":"R1","v":"February"},"March","April","May","June","July","August","September","October","November","December",null,null,"Var%",{"$f":"AK1","v":"January"},{"$f":"AL1","v":"February"},"March","April","May","June","July","August","September","October","November","December"]
[1,"SAVINGS",{"$f":"VLOOKUP(CONCATENATE(\"Total \",$B2),Jan!$C:$F,3,FALSE)","v":0},{"$f":"VLOOKUP(CONCATENATE(\"Total \",$B2),Feb!$C:$F,3,FALSE)","v":0},{"$f":"VLOOKUP(CONCATENATE(\"Total \",$B2),Mar!$C:$F,3,FALSE)","v":0},{"$f":"VLOOKUP(CONCATENATE(\"Total \",$B2),Apr!$C:$F,3,FALSE)","v":0},{"$f":"VLOOKUP(CONCATENATE(\"Total \",$B2),May!$C:$F,3,FALSE)","v":0},{"$f":"VLOOKUP(CONCATENATE(\"Total \",$B2),Jun!$C:$F,3,FALSE)","v":0},{"$f":"VLOOKUP(CONCATENATE(\"Total \",$B2),Jul!$C:$F,3,FALSE)","v":0},{"$f":"VLOOKUP(CONCATENATE(\"Total \",$B2),Aug!$C:$F,3,FALSE)","v":0},{"$f":"VLOOKUP(CONCATENATE(\"Total \",$B2),Sep!$C:$F,3,FALSE)","v":0},{"$f":"VLOOKUP(CONCATENATE(\"Total \",$B2),Oct!$C:$F,3,FALSE)","v":0},{"$f":"VLOOKUP(CONCATENATE(\"Total \",$B2),Nov!$C:$F,3,FALSE)","v":0},{"$f":"VLOOKUP(CONCATENATE(\"Total \",$B2),Dec!$C:$F,3,FALSE)","v":0},{"$f":"A2","v":1},{"$f":"$B2","v":"SAVINGS"},{"$f":"VLOOKUP(CONCATENATE(\"Total \",$B2),Jan!$C:$F,2,FALSE)","v":0},{"$f":"VLOOKUP(CONCATENATE(\"Total \",$B2),Feb!$C:$F,2,FALSE)","v":0},{"$f":"VLOOKUP(CONCATENATE(\"Total \",$B2),Mar!$C:$F,2,FALSE)","v":0},{"$f":"VLOOKUP(CONCATENATE(\"Total \",$B2),Apr!$C:$F,2,FALSE)","v":0},{"$f":"VLOOKUP(CONCATENATE(\"Total \",$B2),May!$C:$F,2,FALSE)","v":0},{"$f":"VLOOKUP(CONCATENATE(\"Total \",$B2),Jun!$C:$F,2,FALSE)","v":0},{"$f":"VLOOKUP(CONCATENATE(\"Total \",$B2),Jul!$C:$F,2,FALSE)","v":0},{"$f":"VLOOKUP(CONCATENATE(\"Total \",$B2),Aug!$C:$F,2,FALSE)","v":0},{"$f":"VLOOKUP(CONCATENATE(\"Total \",$B2),Sep!$C:$F,2,FALSE)","v":0},{"$f":"VLOOKUP(CONCATENATE(\"Total \",$B2),Oct!$C:$F,2,FALSE)","v":0},{"$f":"VLOOKUP(CONCATENATE(\"Total \",$B2),Nov!$C:$F,2,FALSE)","v":0},{"$f":"VLOOKUP(CONCATENATE(\"Total \",$B2),Dec!$C:$F,2,FALSE)","v":0},null,{"$f":"COUNT($C2:$N2)","v":12},{"$f":"SUM($C2:$N2)","v":0},null,{"$f":"COUNT($Q2:$AB2)","v":12},{"$f":"SUM($Q2:$AB2)","v":0},null,{"$f":"$B2","v":"SAVINGS"},{"$f":"Q2-C2","v":0},{"$f":"R2-D2","v":0},0,0,0,0,0,0,0,0,0,0,{"$f":"SUM(AK2:AV2)","v":0},null,{"$f":"$B2","v":"SAVINGS"},{"$f":"IFERROR(AK2/Q2,0)","v":0},{"$f":"IFERROR(AL2/R2,0)","v":0},0,0,0,0,0,0,0,0,0,0]
[{"$f":"A2+1","v":2},"INVESTING",{"$f":"VLOOKUP(CONCATENATE(\"Total \",$B3),Jan!$C:$F,3,FALSE)","v":0},{"$f":"VLOOKUP(CONCATENATE(\"Total \",$B3),Feb!$C:$F,3,FALSE)","v":0},{"$f":"VLOOKUP(CONCATENATE(\"Total \",$B3),Mar!$C:$F,3,FALSE)","v":0},{"$f":"VLOOKUP(CONCATENATE(\"Total \",$B3),Apr!$C:$F,3,FALSE)","v":0},{"$f":"VLOOKUP(CONCATENATE(\"Total \",$B3),May!$C:$F,3,FALSE)","v":0},{"$f":"VLOOKUP(CONCATENATE(\"Total \",$B3),Jun!$C:$F,3,FALSE)","v":0},{"$f":"VLOOKUP(CONCATENATE(\"Total \",$B3),Jul!$C:$F,3,FALSE)","v":0},{"$f":"VLOOKUP(CONCATENATE(\"Total \",$B3),Aug!$C:$F,3,FALSE)","v":0},{"$f":"VLOOKUP(CONCATENATE(\"Total \",$B3),Sep!$C:$F,3,FALSE)","v":0},{"$f":"VLOOKUP(CONCATENATE(\"Total \",$B3),Oct!$C:$F,3,FALSE)","v":0},{"$f":"VLOOKUP(CONCATENATE(\"Total \",$B3),Nov!$C:$F,3,FALSE)","v":0},{"$f":"VLOOKUP(CONCATENATE(\"Total \",$B3),Dec!$C:$F,3,FALSE)","v":0},2,{"$f":"$B3","v":"INVESTING"},{"$f":"VLOOKUP(CONCATENATE(\"Total \",$B3),Jan!$C:$F,2,FALSE)","v":0},{"$f":"VLOOKUP(CONCATENATE(\"Total \",$B3),Feb!$C:$F,2,FALSE)","v":0},{"$f":"VLOOKUP(CONCATENATE(\"Total \",$B3),Mar!$C:$F,2,FALSE)","v":0},{"$f":"VLOOKUP(CONCATENATE(\"Total \",$B3),Apr!$C:$F,2,FALSE)","v":0},{"$f":"VLOOKUP(CONCATENATE(\"Total \",$B3),May!$C:$F,2,FALSE)","v":0},{"$f":"VLOOKUP(CONCATENATE(\"Total \",$B3),Jun!$C:$F,2,FALSE)","v":0},{"$f":"VLOOKUP(CONCATENATE(\"Total \",$B3),Jul!$C:$F,2,FALSE)","v":0},{"$f":"VLOOKUP(CONCATENATE(\"Total \",$B3),Aug!$C:$F,2,FALSE)","v":0},{"$f":"VLOOKUP(CONCATENATE(\"Total \",$B3),Sep!$C:$F,2,FALSE)","v":0},{"$f":"VLOOKUP(CONCATENATE(\"Total \",$B3),Oct!$C:$F,2,FALSE)","v":0},{"$f":"VLOOKUP(CONCATENATE(\"Total \",$B3),Nov!$C:$F,2,FALSE)","v":0},{"$f":"VLOOKUP(CONCATENATE(\"Total \",$B3),Dec!$C:$F,2,FALSE)","v":0},null,12,0,null,12,0,null,{"$f":"$B3","v":"INVESTING"},{"$f":"Q3-C3","v":0},{"$f":"R3-D3","v":0},{"$f":"S3-E3","v":0},{"$f":"T3-F3","v":0},{"$f":"U3-G3","v":0},{"$f":"V3-H3","v":0},{"$f":"W3-I3","v":0},{"$f":"X3-J3","v":0},{"$f":"Y3-K3","v":0},{"$f":"Z3-L3","v":0},{"$f":"AA3-M3","v":0},{"$f":"AB3-N3","v":0},{"$f":"SUM(AK3:AV3)","v":0},null,{"$f":"$B3","v":"INVESTING"},{"$f":"IFERROR(AK3/Q3,0)","v":0},{"$f":"IFERROR(AL3/R3,0)","v":0},{"$f":"IFERROR(AM3/S3,0)","v":0},{"$f":"IFERROR(AN3/T3,0)","v":0},{"$f":"IFERROR(AO3/U3,0)","v":0},{"$f":"IFERROR(AP3/V3,0)","v":0},{"$f":"IFERROR(AQ3/W3,0)","v":0},{"$f":"IFERROR(AR3/X3,0)","v":0},{"$f":"IFERROR(AS3/Y3,0)","v":0},{"$f":"IFERROR(AT3/Z3,0)","v":0},{"$f":"IFERROR(AU3/AA3,0)","v":0},{"$f":"IFERROR(AV3/AB3,0)","v":0}]
[3,"HOME",{"$f":"VLOOKUP(CONCATENATE(\"Total \",$B4),Jan!$C:$F,3,FALSE)","v":0},{"$f":"VLOOKUP(CONCATENATE(\"Total \",$B4),Feb!$C:$F,3,FALSE)","v":0},{"$f":"VLOOKUP(CONCATENATE(\"Total \",$B4),Mar!$C:$F,3,FALSE)","v":0},{"$f":"VLOOKUP(CONCATENATE(\"Total \",$B4),Apr!$C:$F,3,FALSE)","v":0},{"$f":"VLOOKUP(CONCATENATE(\"Total \",$B4),May!$C:$F,3,FALSE)","v":0},{"$f":"VLOOKUP(CONCATENATE(\"Total \",$B4),Jun!$C:$F,3,FALSE)","v":0},{"$f":"VLOOKUP(CONCATENATE(\"Total \",$B4),Jul!$C:$F,3,FALSE)","v":0},{"$f":"VLOOKUP(CONCATENATE(\"Total \",$B4),Aug!$C:$F,3,FALSE)","v":0},{"$f":"VLOOKUP(CONCATENATE(\"Total \",$B4),Sep!$C:$F,3,FALSE)","v":0},{"$f":"VLOOKUP(CONCATENATE(\"Total \",$B4),Oct!$C:$F,3,FALSE)","v":0},{"$f":"VLOOKUP(CONCATENATE(\"Total \",$B4),Nov!$C:$F,3,FALSE)","v":0},{"$f":"VLOOKUP(CONCATENATE(\"Total \",$B4),Dec!$C:$F,3,FALSE)","v":0},3,"HOME",{"$f":"VLOOKUP(CONCATENATE(\"Total \",$B4),Jan!$C:$F,2,FALSE)","v":0},{"$f":"VLOOKUP(CONCATENATE(\"Total \",$B4),Feb!$C:$F,2,FALSE)","v":0},{"$f":"VLOOKUP(CONCATENATE(\"Total \",$B4),Mar!$C:$F,2,FALSE)","v":0},{"$f":"VLOOKUP(CONCATENATE(\"Total \",$B4),Apr!$C:$F,2,FALSE)","v":0},{"$f":"VLOOKUP(CONCATENATE(\"Total \",$B4),May!$C:$F,2,FALSE)","v":0},{"$f":"VLOOKUP(CONCATENATE(\"Total \",$B4),Jun!$C:$F,2,FALSE)","v":0},{"$f":"VLOOKUP(CONCATENATE(\"Total \",$B4),Jul!$C:$F,2,FALSE)","v":0},{"$f":"VLOOKUP(CONCATENATE(\"Total \",$B4),Aug!$C:$F,2,FALSE)","v":0},{"$f":"VLOOKUP(CONCATENATE(\"Total \",$B4),Sep!$C:$F,2,FALSE)","v":0},{"$f":"VLOOKUP(CONCATENATE(\"Total \",$B4),Oct!$C:$F,2,FALSE)","v":0},{"$f":"VLOOKUP(CONCATENATE(\"Total \",$B4),Nov!$C:$F,2,FALSE)","v":0},{"$f":"VLOOKUP(CONCATENATE(\"Total \",$B4),Dec!$C:$F,2,FALSE)","v":0},null,12,0,null,12,0,null,"HOME",0,0,0,0,0,0,0,0,0,0,0,0,0,null,"HOME",0,0,0,0,0,0,0,0,0,0,0,0]
[4,"PERSONAL/ FAMILY",{"$f":"VLOOKUP(CONCATENATE(\"Total \",$B5),Jan!$C:$F,3,FALSE)","v":0},{"$f":"VLOOKUP(CONCATENATE(\"Total \",$B5),Feb!$C:$F,3,FALSE)","v":0},{"$f":"VLOOKUP(CONCATENATE(\"Total \",$B5),Mar!$C:$F,3,FALSE)","v":0},{"$f":"VLOOKUP(CONCATENATE(\"Total \",$B5),Apr!$C:$F,3,FALSE)","v":0},{"$f":"VLOOKUP(CONCATENATE(\"Total \",$B5),May!$C:$F,3,FALSE)","v":0},{"$f":"VLOOKUP(CONCATENATE(\"Total \",$B5),Jun!$C:$F,3,FALSE)","v":0},{"$f":"VLOOKUP(CONCATENATE(\"Total \",$B5),Jul!$C:$F,3,FALSE)","v":0},{"$f":"VLOOKUP(CONCATENATE(\"Total \",$B5),Aug!$C:$F,3,FALSE)","v":0},{"$f":"VLOOKUP(CONCATENATE(\"Total \",$B5),Sep!$C:$F,3,FALSE)","v":0},{"$f":"VLOOKUP(CONCATENATE(\"Total \",$B5),Oct!$C:$F,3,FALSE)","v":0},{"$f":"VLOOKUP(CONCATENATE(\"Total \",$B5),Nov!$C:$F,3,FALSE)","v":0},{"$f":"VLOOKUP(CONCATENATE(\"Total \",$B5),Dec!$C:$F,3,FALSE)","v":0},4,"PERSONAL/ FAMILY",{"$f":"VLOOKUP(CONCATENATE(\"Total \",$B5),Jan!$C:$F,2,FALSE)","v":0},{"$f":"VLOOKUP(CONCATENATE(\"Total \",$B5),Feb!$C:$F,2,FALSE)","v":0},{"$f":"VLOOKUP(CONCATENATE(\"Total \",$B5),Mar!$C:$F,2,FALSE)","v":0},{"$f":"VLOOKUP(CONCATENATE(\"Total \",$B5),Apr!$C:$F,2,FALSE)","v":0},{"$f":"VLOOKUP(CONCATENATE(\"Total \",$B5),May!$C:$F,2,FALSE)","v":0},{"$f":"VLOOKUP(CONCATENATE(\"Total \",$B5),Jun!$C:$F,2,FALSE)","v":0},{"$f":"VLOOKUP(CONCATENATE(\"Total \",$B5),Jul!$C:$F,2,FALSE)","v":0},{"$f":"VLOOKUP(CONCATENATE(\"Total \",$B5),Aug!$C:$F,2,FALSE)","v":0},{"$f":"VLOOKUP(CONCATENATE(\"Total \",$B5),Sep!$C:$F,2,FALSE)","v":0},{"$f":"VLOOKUP(CONCATENATE(\"Total \",$B5),Oct!$C:$F,2,FALSE)","v":0},{"$f":"VLOOKUP(CONCATENATE(\"Total \",$B5),Nov!$C:$F,2,FALSE)","v":0},{"$f":"VLOOKUP(CONCATENATE(\"Total \",$B5),Dec!$C:$F,2,FALSE)","v":0},null,12,0,null,12,0,null,"PERSONAL/ FAMILY",0,0,0,0,0,0,0,0,0,0,0,0,0,null,"PERSONAL/ FAMILY",0,0,0,0,0,0,0,0,0,0,0,0]
[5,"CAR/ TRANSPORTATION",{"$f":"VLOOKUP(CONCATENATE(\"Total \",$B6),Jan!$C:$F,3,FALSE)","v":0},{"$f":"VLOOKUP(CONCATENATE(\"Total \",$B6),Feb!$C:$F,3,FALSE)","v":0},{"$f":"VLOOKUP(CONCATENATE(\"Total \",$B6),Mar!$C:$F,3,FALSE)","v":0},{"$f":"VLOOKUP(CONCATENATE(\"Total \",$B6),Apr!$C:$F,3,FALSE)","v":0},{"$f":"VLOOKUP(CONCATENATE(\"Total \",$B6),May!$C:$F,3,FALSE)","v":0},{"$f":"VLOOKUP(CONCATENATE(\"Total \",$B6),Jun!$C:$F,3,FALSE)","v":0},{"$f":"VLOOKUP(CONCATENATE(\"Total \",$B6),Jul!$C:$F,3,FALSE)","v":0},{"$f":"VLOOKUP(CONCATENATE(\"Total \",$B6),Aug!$C:$F,3,FALSE)","v":0},{"$f":"VLOOKUP(CONCATENATE(\"Total \",$B6),Sep!$C:$F,3,FALSE)","v":0},{"$f":"VLOOKUP(CONCATENATE(\"Total \",$B6),Oct!$C:$F,3,FALSE)","v":0},{"$f":"VLOOKUP(CONCATENATE(\"Total \",$B6),Nov!$C:$F,3,FALSE)","v":0},{"$f":"VLOOKUP(CONCATENATE(\"Total \",$B6),Dec!$C:$F,3,FALSE)","v":0},5,"CAR/ TRANSPORTATION",{"$f":"VLOOKUP(CONCATENATE(\"Total \",$B6),Jan!$C:$F,2,FALSE)","v":0},{"$f":"VLOOKUP(CONCATENATE(\"Total \",$B6),Feb!$C:$F,2,FALSE)","v":0},{"$f":"VLOOKUP(CONCATENATE(\"Total \",$B6),Mar!$C:$F,2,FALSE)","v":0},{"$f":"VLOOKUP(CONCATENATE(\"Total \",$B6),Apr!$C:$F,2,FALSE)","v":0},{"$f":"VLOOKUP(CONCATENATE(\"Total \",$B6),May!$C:$F,2,FALSE)","v":0},{"$f":"VLOOKUP(CONCATENATE(\"Total \",$B6),Jun!$C:$F,2,FALSE)","v":0},{"$f":"VLOOKUP(CONCATENATE(\"Total \",$B6),Jul!$C:$F,2,FALSE)","v":0},{"$f":"VLOOKUP(CONCATENATE(\"Total \",$B6),Aug!$C:$F,2,FALSE)","v":0},{"$f":"VLOOKUP(CONCATENATE(\"Total \",$B6),Sep!$C:$F,2,FALSE)","v":0},{"$f":"VLOOKUP(CONCATENATE(\"Total \",$B6),Oct!$C:$F,2,FALSE)","v":0},{"$f":"VLOOKUP(CONCATENATE(\"Total \",$B6),Nov!$C:$F,2,FALSE)","v":0},{"$f":"VLOOKUP(CONCATENATE(\"Total \",$B6),Dec!$C:$F,2,FALSE)","v":0},null,12,0,null,12,0,null,"CAR/ TRANSPORTATION",0,0,0,0,0,0,0,0,0,0,0,0,0,null,"CAR/ TRANSPORTATION",0,0,0,0,0,0,0,0,0,0,0,0]
{"$rows_left_out":12}